{"text_format":"1","workbook":"xlsx","n_sheets":2,"sheets":["印刷","このシートにデータを入力します"],"not_rendered":{"charts":0,"images":0,"macros":1,"external_links":0,"defined_names":3,"comments":0,"pivot_tables":0},"unopened":[],"bounds":{"document_bytes":16777216,"sheet_cells":100000,"rows_first":2000,"rows_last":500,"rows_between":2000,"halvings":0,"cell_chars":16384,"cell_head_chars":4096},"cells_cut":0,"cells_raw":0,"read":"whole","date_system":"1900"}

{"sheet":"印刷","index":0,"n_rows":42,"n_cols":26,"rows_kept":42,"cut":false,"hidden":false,"merged":[[41,1,41,22],[40,23,41,24],[40,25,41,25],[2,11,2,12],[8,4,8,5],[9,5,9,19],[2,14,2,15],[10,5,10,19],[11,5,11,10],[15,1,15,6],[40,1,40,22],[3,1,3,2],[13,1,13,19],[14,1,14,19],[36,22,36,24],[15,7,15,9],[15,10,15,18],[8,11,8,12],[11,12,11,17],[9,3,11,3],[8,1,8,3],[12,1,12,6],[38,22,38,24],[37,22,37,24],[36,3,36,6],[36,7,36,9],[36,10,36,13],[36,14,36,17],[36,18,36,21],[33,3,33,6],[33,7,33,9],[33,10,33,13],[33,14,33,17],[33,18,33,21],[34,3,34,6],[34,7,34,9],[34,10,34,13],[34,14,34,17],[34,18,34,21],[35,22,35,24],[35,3,35,6],[35,7,35,9],[35,10,35,13],[35,14,35,17],[35,18,35,21],[6,1,6,2],[2,20,3,25],[2,1,2,9],[17,1,17,2],[31,1,32,2],[29,1,30,2],[25,1,25,2],[26,1,26,2],[27,1,28,2],[17,3,17,24],[20,3,20,6],[26,22,26,24],[25,22,25,24],[31,3,31,6],[31,7,31,9],[31,10,31,13],[31,14,31,17],[31,18,31,21],[28,18,28,21],[28,3,28,6],[32,3,32,6],[32,7,32,9],[29,18,29,21],[19,7,19,9],[36,1,37,2],[35,1,35,2],[20,1,22,2],[23,1,23,2],[24,1,24,2],[21,3,21,6],[21,7,21,9],[32,18,32,21],[29,3,29,6],[29,7,29,9],[29,10,29,13],[27,18,27,21],[20,14,20,17],[32,10,32,13],[32,14,32,17],[26,18,26,21],[38,1,39,2],[19,3,19,6],[34,22,34,24],[33,22,33,24],[39,22,39,24],[24,22,24,24],[23,22,23,24],[19,1,19,2],[33,1,33,2],[34,1,34,2],[20,18,20,21],[24,18,24,21],[21,10,21,13],[21,14,21,17],[21,18,21,21],[22,3,22,6],[22,7,22,9],[22,10,22,13],[22,14,22,17],[22,18,22,21],[23,15,23,17],[28,7,28,9],[29,14,29,17],[38,7,38,9],[3,18,4,19],[39,3,39,6],[39,7,39,9],[39,10,39,13],[39,14,39,17],[39,18,39,21],[8,20,8,25],[37,3,37,6],[37,7,37,9],[37,10,37,13],[37,14,37,17],[8,18,8,19],[23,3,23,6],[23,7,23,9],[23,10,23,13],[23,18,23,21],[24,3,24,6],[24,7,24,9],[24,10,24,13],[24,14,24,17],[21,22,21,24],[20,25,23,25],[20,7,20,9],[20,10,20,13],[2,18,2,19],[18,1,18,2],[9,1,11,2],[27,14,27,17],[4,20,4,25],[10,20,15,25],[19,22,19,24],[3,17,4,17],[3,3,3,16],[19,10,19,13],[19,18,19,21],[16,1,16,25],[18,7,18,9],[4,1,4,2],[6,20,6,25],[7,20,7,25],[5,1,5,2],[5,12,5,19],[4,3,4,16],[20,22,20,24],[19,15,19,17],[5,3,5,10],[7,7,7,19],[22,22,22,24],[18,22,18,24],[38,10,38,13],[38,14,38,17],[38,18,38,21],[37,18,37,21],[25,3,25,6],[25,7,25,9],[25,10,25,13],[25,14,25,17],[30,3,30,6],[30,7,30,9],[30,10,30,13],[30,14,30,17],[30,18,30,21],[27,10,27,13],[27,7,27,9],[27,3,27,6],[28,10,28,13],[25,18,25,21],[26,3,26,6],[26,7,26,9],[26,10,26,13],[26,14,26,17],[38,3,38,6],[8,13,8,16],[12,7,12,19],[1,1,1,25],[27,25,28,25],[29,25,30,25],[31,25,32,25],[36,25,37,25],[38,25,39,25],[27,22,27,24],[32,22,32,24],[30,22,30,24],[29,22,29,24],[7,1,7,2],[31,22,31,24],[18,10,18,13],[6,3,6,6],[7,3,7,6],[6,7,6,19],[18,14,18,17],[18,18,18,21],[9,20,9,25],[18,3,18,6],[28,22,28,24],[28,14,28,17]]}
[null,null,null,1,1,1,1,2,2,2,3,3,3,3,4,4,4,4,5,5,5,5,6,6,6]
[]
[null,"兵庫県吹奏楽コンクール参加申込書",null,null,null,null,null,null,null,null,"団体\nコード\nNo",{"$f":"MID(このシートにデータを入力します!$F$7,1,1)","v":""},null,{"$f":"MID(このシートにデータを入力します!$F$7,2,1)","v":""},{"$f":"MID(このシートにデータを入力します!$F$7,3,1)","v":""},null,{"$f":"MID(このシートにデータを入力します!$F$7,4,1)","v":""},{"$f":"MID(このシートにデータを入力します!$F$7,5,1)","v":""},{"$f":"MID(このシートにデータを入力します!$F$7,6,1)","v":""}]
[null,"ふりがな",null,{"$f":"このシートにデータを入力します!F9","v":0},null,null,null,null,null,null,null,null,null,null,null,null,null,"団体の総員数\n5/7\n現在",{"$f":"このシートにデータを入力します!F12","v":0}]
[null,"団体名",null,{"$f":"このシートにデータを入力します!F10","v":0},null,null,null,null,null,null,null,null,null,null,null,null,null,null,null,null,"振込金受領書コピー"]
[null,"団体長 (学校長)",null,{"$f":"このシートにデータを入力します!F14","v":0},null,null,null,null,null,null,null,"指揮者名",{"$f":"このシートにデータを入力します!F16","v":0}]
[null,"所在地",null,{"$f":"IF(このシートにデータを入力します!G18=\"\",\"\",\"〒\"&このシートにデータを入力します!G18)","v":""},null,null,null,{"$f":"このシートにデータを入力します!I18","v":0},null,null,null,null,null,null,null,null,null,null,null,null,"添付"]
[null,"書類\n送付先",null,{"$f":"IF(このシートにデータを入力します!G20=\"\",\"\",\"〒\"&このシートにデータを入力します!G20)","v":""},null,null,null,{"$f":"このシートにデータを入力します!I20","v":0}]
[null,"参加部門\n(いずれかに○)",null,null,"中Ａ",null,"中Ｓ","高A","高Ｓ","大","職・一","祭",null,null,null,null,null,"ピアノ\n使用",{"$f":"IF(このシートにデータを入力します!F24=\"\",\"有　無\",このシートにデータを入力します!F24)","v":"有　無"},null,"参加費１チーム"]
[null,"演奏曲目",null,"自由曲","原語",{"$f":"このシートにデータを入力します!F26","v":0},null,null,null,null,null,null,null,null,null,null,null,null,null,null,"６，０００円"]
[null,null,null,null,"日本語",{"$f":"このシートにデータを入力します!F27","v":0},null,null,null,null,null,null,null,null,null,null,null,null,null,null,"\n\n\n\n\n収集した個人情報は適切に\n処理いたします。"]
[null,null,null,null,"作曲者",{"$f":"このシートにデータを入力します!F28","v":0},null,null,null,null,null,"編曲者",{"$f":"このシートにデータを入力します!F29","v":0},null,null,null,null,null,"課題曲",{"$f":"このシートにデータを入力します!F32","v":0}]
[null,"著作権のある作品の許諾先",null,null,null,null,null,{"$f":"このシートにデータを入力します!F30","v":0}]
[null,"この申込書の記載に相違はありません。　また指揮者名のプログラム掲載を了承します。"]
[null,{"$f":"IF(このシートにデータを入力します!F34=\"\",\"令和　　　　年　　 　月　 　日　　　記載責任者名　　　　　　　　　　　　　　　　　　　\",\" 令和 \"&YEAR(このシートにデータを入力します!F34)-2018&\" 年 \"&MONTH(このシートにデータを入力します!F34)&\" 月 \"&DAY(このシートにデータを入力します!F34)&\" 日　     記載責任者　　\"&このシートにデータを入力します!F36&\"　　\")","v":"令和　　　　年　　 　月　 　日　　　記載責任者名　　　　　　　　　　　　　　　　　　　"}]
[null,null,null,null,null,null,null,"緊急連絡先\n(携帯電話)",null,null,{"$f":"このシートにデータを入力します!F38","v":0}]
[]
[null,"楽器名",null,"担当者名　　＊学校団体は学年を記入 (例：山田太郎③) 　＊課題曲を演奏する部門は課題曲演奏時の編成を記載すること",null,null,null,null,null,null,null,null,null,null,null,null,null,null,null,null,null,null,null,null,null,"人数"]
[1,"Pic Fl",null,{"$f":"INDEX(このシートにデータを入力します!$B$49:$AA$66,D$1,$A19)&IF(INDEX(このシートにデータを入力します!$B$49:$AA$66,D$1,$A19+1)=\"\",\"\",\" (\"&INDEX(このシートにデータを入力します!$B$49:$AA$66,D$1,$A19+1)&\"年)\")","v":""},null,null,null,{"$f":"INDEX(このシートにデータを入力します!$B$49:$AA$66,H$1,$A19)&IF(INDEX(このシートにデータを入力します!$B$49:$AA$66,H$1,$A19+1)=\"\",\"\",\" (\"&INDEX(このシートにデータを入力します!$B$49:$AA$66,H$1,$A19+1)&\"年)\")","v":""},null,null,{"$f":"INDEX(このシートにデータを入力します!$B$49:$AA$66,K$1,$A19)&IF(INDEX(このシートにデータを入力します!$B$49:$AA$66,K$1,$A19+1)=\"\",\"\",\" (\"&INDEX(このシートにデータを入力します!$B$49:$AA$66,K$1,$A19+1)&\"年)\")","v":""},null,null,null,{"$f":"INDEX(このシートにデータを入力します!$B$49:$AA$66,O$1,$A19)&IF(INDEX(このシートにデータを入力します!$B$49:$AA$66,O$1,$A19+1)=\"\",\"\",\" (\"&INDEX(このシートにデータを入力します!$B$49:$AA$66,O$1,$A19+1)&\"年)\")","v":""},null,null,null,{"$f":"INDEX(このシートにデータを入力します!$B$49:$AA$66,S$1,$A19)&IF(INDEX(このシートにデータを入力します!$B$49:$AA$66,S$1,$A19+1)=\"\",\"\",\" (\"&INDEX(このシートにデータを入力します!$B$49:$AA$66,S$1,$A19+1)&\"年)\")","v":""},null,null,null,{"$f":"INDEX(このシートにデータを入力します!$B$49:$AA$66,W$1,$A19)&IF(INDEX(このシートにデータを入力します!$B$49:$AA$66,W$1,$A19+1)=\"\",\"\",\" (\"&INDEX(このシートにデータを入力します!$B$49:$AA$66,W$1,$A19+1)&\"年)\")","v":""},null,null,{"$f":"このシートにデータを入力します!B46","v":0}]
[4,"Ob",null,{"$f":"INDEX(このシートにデータを入力します!$B$49:$AA$66,D$1,$A20)&IF(INDEX(このシートにデータを入力します!$B$49:$AA$66,D$1,$A20+1)=\"\",\"\",\" (\"&INDEX(このシートにデータを入力します!$B$49:$AA$66,D$1,$A20+1)&\"年)\")","v":""},null,null,null,{"$f":"INDEX(このシートにデータを入力します!$B$49:$AA$66,H$1,$A20)&IF(INDEX(このシートにデータを入力します!$B$49:$AA$66,H$1,$A20+1)=\"\",\"\",\" (\"&INDEX(このシートにデータを入力します!$B$49:$AA$66,H$1,$A20+1)&\"年)\")","v":""},null,null,{"$f":"INDEX(このシートにデータを入力します!$B$49:$AA$66,K$1,$A20)&IF(INDEX(このシートにデータを入力します!$B$49:$AA$66,K$1,$A20+1)=\"\",\"\",\" (\"&INDEX(このシートにデータを入力します!$B$49:$AA$66,K$1,$A20+1)&\"年)\")","v":""},null,null,null,"Fg ",{"$f":"INDEX(このシートにデータを入力します!$B$49:$AA$66,P$1-3,$A20+3)&IF(INDEX(このシートにデータを入力します!$B$49:$AA$66,P$1-3,$A20+4)=\"\",\"\",\" (\"&INDEX(このシートにデータを入力します!$B$49:$AA$66,P$1-3,$A20+4)&\"年)\")","v":""},null,null,{"$f":"INDEX(このシートにデータを入力します!$B$49:$AA$66,S$1-3,$A20+3)&IF(INDEX(このシートにデータを入力します!$B$49:$AA$66,S$1-3,$A20+4)=\"\",\"\",\" (\"&INDEX(このシートにデータを入力します!$B$49:$AA$66,S$1-3,$A20+4)&\"年)\")","v":""},null,null,null,{"$f":"INDEX(このシートにデータを入力します!$B$49:$AA$66,W$1-3,$A20+3)&IF(INDEX(このシートにデータを入力します!$B$49:$AA$66,W$1-3,$A20+4)=\"\",\"\",\" (\"&INDEX(このシートにデータを入力します!$B$49:$AA$66,W$1-3,$A20+4)&\"年)\")","v":""},null,null,{"$f":"このシートにデータを入力します!E46+このシートにデータを入力します!H46","v":0}]
[10,"EbCl\nBbCl",null,{"$f":"INDEX(このシートにデータを入力します!$B$49:$AA$66,D$1,$A21)&IF(INDEX(このシートにデータを入力します!$B$49:$AA$66,D$1,$A21+1)=\"\",\"\",\" (\"&INDEX(このシートにデータを入力します!$B$49:$AA$66,D$1,$A21+1)&\"年)\")","v":""},null,null,null,{"$f":"INDEX(このシートにデータを入力します!$B$49:$AA$66,H$1,$A21)&IF(INDEX(このシートにデータを入力します!$B$49:$AA$66,H$1,$A21+1)=\"\",\"\",\" (\"&INDEX(このシートにデータを入力します!$B$49:$AA$66,H$1,$A21+1)&\"年)\")","v":""},null,null,{"$f":"INDEX(このシートにデータを入力します!$B$49:$AA$66,K$1,$A21)&IF(INDEX(このシートにデータを入力します!$B$49:$AA$66,K$1,$A21+1)=\"\",\"\",\" (\"&INDEX(このシートにデータを入力します!$B$49:$AA$66,K$1,$A21+1)&\"年)\")","v":""},null,null,null,{"$f":"INDEX(このシートにデータを入力します!$B$49:$AA$66,O$1,$A21)&IF(INDEX(このシートにデータを入力します!$B$49:$AA$66,O$1,$A21+1)=\"\",\"\",\" (\"&INDEX(このシートにデータを入力します!$B$49:$AA$66,O$1,$A21+1)&\"年)\")","v":""},null,null,null,{"$f":"INDEX(このシートにデータを入力します!$B$49:$AA$66,S$1,$A21)&IF(INDEX(このシートにデータを入力します!$B$49:$AA$66,S$1,$A21+1)=\"\",\"\",\" (\"&INDEX(このシートにデータを入力します!$B$49:$AA$66,S$1,$A21+1)&\"年)\")","v":""},null,null,null,{"$f":"INDEX(このシートにデータを入力します!$B$49:$AA$66,W$1,$A21)&IF(INDEX(このシートにデータを入力します!$B$49:$AA$66,W$1,$A21+1)=\"\",\"\",\" (\"&INDEX(このシートにデータを入力します!$B$49:$AA$66,W$1,$A21+1)&\"年)\")","v":""},null,null,{"$f":"このシートにデータを入力します!K46+このシートにデータを入力します!N46+このシートにデータを入力します!Q46","v":0}]
[10,null,null,{"$f":"INDEX(このシートにデータを入力します!$B$49:$AA$66,D$1+6,$A22)&IF(INDEX(このシートにデータを入力します!$B$49:$AA$66,D$1+6,$A22+1)=\"\",\"\",\" (\"&INDEX(このシートにデータを入力します!$B$49:$AA$66,D$1+6,$A22+1)&\"年)\")","v":""},null,null,null,{"$f":"INDEX(このシートにデータを入力します!$B$49:$AA$66,H$1+6,$A22)&IF(INDEX(このシートにデータを入力します!$B$49:$AA$66,H$1+6,$A22+1)=\"\",\"\",\" (\"&INDEX(このシートにデータを入力します!$B$49:$AA$66,H$1+6,$A22+1)&\"年)\")","v":""},null,null,{"$f":"INDEX(このシートにデータを入力します!$B$49:$AA$66,K$1+6,$A22)&IF(INDEX(このシートにデータを入力します!$B$49:$AA$66,K$1+6,$A22+1)=\"\",\"\",\" (\"&INDEX(このシートにデータを入力します!$B$49:$AA$66,K$1+6,$A22+1)&\"年)\")","v":""},null,null,null,{"$f":"INDEX(このシートにデータを入力します!$B$49:$AA$66,O$1+6,$A22)&IF(INDEX(このシートにデータを入力します!$B$49:$AA$66,O$1+6,$A22+1)=\"\",\"\",\" (\"&INDEX(このシートにデータを入力します!$B$49:$AA$66,O$1+6,$A22+1)&\"年)\")","v":""},null,null,null,{"$f":"INDEX(このシートにデータを入力します!$B$49:$AA$66,S$1+6,$A22)&IF(INDEX(このシートにデータを入力します!$B$49:$AA$66,S$1+6,$A22+1)=\"\",\"\",\" (\"&INDEX(このシートにデータを入力します!$B$49:$AA$66,S$1+6,$A22+1)&\"年)\")","v":""},null,null,null,{"$f":"INDEX(このシートにデータを入力します!$B$49:$AA$66,W$1+6,$A22)&IF(INDEX(このシートにデータを入力します!$B$49:$AA$66,W$1+6,$A22+1)=\"\",\"\",\" (\"&INDEX(このシートにデータを入力します!$B$49:$AA$66,W$1+6,$A22+1)&\"年)\")","v":""}]
[10,null,null,{"$f":"INDEX(このシートにデータを入力します!$B$49:$AA$66,D$1+12,$A23)&IF(INDEX(このシートにデータを入力します!$B$49:$AA$66,D$1+12,$A23+1)=\"\",\"\",\" (\"&INDEX(このシートにデータを入力します!$B$49:$AA$66,D$1+12,$A23+1)&\"年)\")","v":""},null,null,null,{"$f":"INDEX(このシートにデータを入力します!$B$49:$AA$66,H$1+12,$A23)&IF(INDEX(このシートにデータを入力します!$B$49:$AA$66,H$1+12,$A23+1)=\"\",\"\",\" (\"&INDEX(このシートにデータを入力します!$B$49:$AA$66,H$1+12,$A23+1)&\"年)\")","v":""},null,null,{"$f":"INDEX(このシートにデータを入力します!$B$49:$AA$66,K$1+12,$A23)&IF(INDEX(このシートにデータを入力します!$B$49:$AA$66,K$1+12,$A23+1)=\"\",\"\",\" (\"&INDEX(このシートにデータを入力します!$B$49:$AA$66,K$1+12,$A23+1)&\"年)\")","v":""},null,null,null,{"$f":"INDEX(このシートにデータを入力します!$B$49:$AA$66,O$1+12,$A23)&IF(INDEX(このシートにデータを入力します!$B$49:$AA$66,O$1+12,$A23+1)=\"\",\"\",\" (\"&INDEX(このシートにデータを入力します!$B$49:$AA$66,O$1+12,$A23+1)&\"年)\")","v":""},null,null,null,{"$f":"INDEX(このシートにデータを入力します!$B$49:$AA$66,S$1+12,$A23)&IF(INDEX(このシートにデータを入力します!$B$49:$AA$66,S$1+12,$A23+1)=\"\",\"\",\" (\"&INDEX(このシートにデータを入力します!$B$49:$AA$66,S$1+12,$A23+1)&\"年)\")","v":""},null,null,null,{"$f":"INDEX(このシートにデータを入力します!$B$49:$AA$66,W$1+12,$A23)&IF(INDEX(このシートにデータを入力します!$B$49:$AA$66,W$1+12,$A23+1)=\"\",\"\",\" (\"&INDEX(このシートにデータを入力します!$B$49:$AA$66,W$1+12,$A23+1)&\"年)\")","v":""}]
[13,"A.Cl",null,{"$f":"INDEX(このシートにデータを入力します!$B$49:$AA$66,D$1,$A24)&IF(INDEX(このシートにデータを入力します!$B$49:$AA$66,D$1,$A24+1)=\"\",\"\",\" (\"&INDEX(このシートにデータを入力します!$B$49:$AA$66,D$1,$A24+1)&\"年)\")","v":""},null,null,null,{"$f":"INDEX(このシートにデータを入力します!$B$49:$AA$66,H$1,$A24)&IF(INDEX(このシートにデータを入力します!$B$49:$AA$66,H$1,$A24+1)=\"\",\"\",\" (\"&INDEX(このシートにデータを入力します!$B$49:$AA$66,H$1,$A24+1)&\"年)\")","v":""},null,null,{"$f":"INDEX(このシートにデータを入力します!$B$49:$AA$66,K$1,$A24)&IF(INDEX(このシートにデータを入力します!$B$49:$AA$66,K$1,$A24+1)=\"\",\"\",\" (\"&INDEX(このシートにデータを入力します!$B$49:$AA$66,K$1,$A24+1)&\"年)\")","v":""},null,null,null,"B.Cl",{"$f":"INDEX(このシートにデータを入力します!$B$49:$AA$66,P$1-3,$A24+3)&IF(INDEX(このシートにデータを入力します!$B$49:$AA$66,P$1-3,$A24+4)=\"\",\"\",\" (\"&INDEX(このシートにデータを入力します!$B$49:$AA$66,P$1-3,$A24+4)&\"年)\")","v":""},null,null,{"$f":"INDEX(このシートにデータを入力します!$B$49:$AA$66,S$1-3,$A24+3)&IF(INDEX(このシートにデータを入力します!$B$49:$AA$66,S$1-3,$A24+4)=\"\",\"\",\" (\"&INDEX(このシートにデータを入力します!$B$49:$AA$66,S$1-3,$A24+4)&\"年)\")","v":""},null,null,null,{"$f":"INDEX(このシートにデータを入力します!$B$49:$AA$66,W$1-3,$A24+3)&IF(INDEX(このシートにデータを入力します!$B$49:$AA$66,W$1-3,$A24+4)=\"\",\"\",\" (\"&INDEX(このシートにデータを入力します!$B$49:$AA$66,W$1-3,$A24+4)&\"年)\")","v":""}]
[19,"A.Sax",null,{"$f":"INDEX(このシートにデータを入力します!$B$49:$AA$66,D$1,$A25)&IF(INDEX(このシートにデータを入力します!$B$49:$AA$66,D$1,$A25+1)=\"\",\"\",\" (\"&INDEX(このシートにデータを入力します!$B$49:$AA$66,D$1,$A25+1)&\"年)\")","v":""},null,null,null,{"$f":"INDEX(このシートにデータを入力します!$B$49:$AA$66,H$1,$A25)&IF(INDEX(このシートにデータを入力します!$B$49:$AA$66,H$1,$A25+1)=\"\",\"\",\" (\"&INDEX(このシートにデータを入力します!$B$49:$AA$66,H$1,$A25+1)&\"年)\")","v":""},null,null,{"$f":"INDEX(このシートにデータを入力します!$B$49:$AA$66,K$1,$A25)&IF(INDEX(このシートにデータを入力します!$B$49:$AA$66,K$1,$A25+1)=\"\",\"\",\" (\"&INDEX(このシートにデータを入力します!$B$49:$AA$66,K$1,$A25+1)&\"年)\")","v":""},null,null,null,{"$f":"INDEX(このシートにデータを入力します!$B$49:$AA$66,O$1,$A25)&IF(INDEX(このシートにデータを入力します!$B$49:$AA$66,O$1,$A25+1)=\"\",\"\",\" (\"&INDEX(このシートにデータを入力します!$B$49:$AA$66,O$1,$A25+1)&\"年)\")","v":""},null,null,null,{"$f":"INDEX(このシートにデータを入力します!$B$49:$AA$66,S$1,$A25)&IF(INDEX(このシートにデータを入力します!$B$49:$AA$66,S$1,$A25+1)=\"\",\"\",\" (\"&INDEX(このシートにデータを入力します!$B$49:$AA$66,S$1,$A25+1)&\"年)\")","v":""},null,null,null,{"$f":"INDEX(このシートにデータを入力します!$B$49:$AA$66,W$1,$A25)&IF(INDEX(このシートにデータを入力します!$B$49:$AA$66,W$1,$A25+1)=\"\",\"\",\" (\"&INDEX(このシートにデータを入力します!$B$49:$AA$66,W$1,$A25+1)&\"年)\")","v":""},null,null,{"$f":"このシートにデータを入力します!T46","v":0}]
[22,"T.Sax",null,{"$f":"INDEX(このシートにデータを入力します!$B$49:$AA$66,D$1,$A26)&IF(INDEX(このシートにデータを入力します!$B$49:$AA$66,D$1,$A26+1)=\"\",\"\",\" (\"&INDEX(このシートにデータを入力します!$B$49:$AA$66,D$1,$A26+1)&\"年)\")","v":""},null,null,null,{"$f":"INDEX(このシートにデータを入力します!$B$49:$AA$66,H$1,$A26)&IF(INDEX(このシートにデータを入力します!$B$49:$AA$66,H$1,$A26+1)=\"\",\"\",\" (\"&INDEX(このシートにデータを入力します!$B$49:$AA$66,H$1,$A26+1)&\"年)\")","v":""},null,null,{"$f":"INDEX(このシートにデータを入力します!$B$49:$AA$66,K$1,$A26)&IF(INDEX(このシートにデータを入力します!$B$49:$AA$66,K$1,$A26+1)=\"\",\"\",\" (\"&INDEX(このシートにデータを入力します!$B$49:$AA$66,K$1,$A26+1)&\"年)\")","v":""},null,null,null,{"$f":"INDEX(このシートにデータを入力します!$B$49:$AA$66,O$1,$A26)&IF(INDEX(このシートにデータを入力します!$B$49:$AA$66,O$1,$A26+1)=\"\",\"\",\" (\"&INDEX(このシートにデータを入力します!$B$49:$AA$66,O$1,$A26+1)&\"年)\")","v":""},null,null,null,{"$f":"INDEX(このシートにデータを入力します!$B$49:$AA$66,S$1,$A26)&IF(INDEX(このシートにデータを入力します!$B$49:$AA$66,S$1,$A26+1)=\"\",\"\",\" (\"&INDEX(このシートにデータを入力します!$B$49:$AA$66,S$1,$A26+1)&\"年)\")","v":""},null,null,null,{"$f":"INDEX(このシートにデータを入力します!$B$49:$AA$66,W$1,$A26)&IF(INDEX(このシートにデータを入力します!$B$49:$AA$66,W$1,$A26+1)=\"\",\"\",\" (\"&INDEX(このシートにデータを入力します!$B$49:$AA$66,W$1,$A26+1)&\"年)\")","v":""},null,null,{"$f":"このシートにデータを入力します!W46","v":0}]
[25,"B.Sax",null,{"$f":"INDEX(このシートにデータを入力します!$B$49:$AA$66,D$1,$A27)&IF(INDEX(このシートにデータを入力します!$B$49:$AA$66,D$1,$A27+1)=\"\",\"\",\" (\"&INDEX(このシートにデータを入力します!$B$49:$AA$66,D$1,$A27+1)&\"年)\")","v":""},null,null,null,{"$f":"INDEX(このシートにデータを入力します!$B$49:$AA$66,H$1,$A27)&IF(INDEX(このシートにデータを入力します!$B$49:$AA$66,H$1,$A27+1)=\"\",\"\",\" (\"&INDEX(このシートにデータを入力します!$B$49:$AA$66,H$1,$A27+1)&\"年)\")","v":""},null,null,{"$f":"INDEX(このシートにデータを入力します!$B$49:$AA$66,K$1,$A27)&IF(INDEX(このシートにデータを入力します!$B$49:$AA$66,K$1,$A27+1)=\"\",\"\",\" (\"&INDEX(このシートにデータを入力します!$B$49:$AA$66,K$1,$A27+1)&\"年)\")","v":""},null,null,null,{"$f":"INDEX(このシートにデータを入力します!$B$49:$AA$66,O$1,$A27)&IF(INDEX(このシートにデータを入力します!$B$49:$AA$66,O$1,$A27+1)=\"\",\"\",\" (\"&INDEX(このシートにデータを入力します!$B$49:$AA$66,O$1,$A27+1)&\"年)\")","v":""},null,null,null,{"$f":"INDEX(このシートにデータを入力します!$B$49:$AA$66,S$1,$A27)&IF(INDEX(このシートにデータを入力します!$B$49:$AA$66,S$1,$A27+1)=\"\",\"\",\" (\"&INDEX(このシートにデータを入力します!$B$49:$AA$66,S$1,$A27+1)&\"年)\")","v":""},null,null,null,{"$f":"INDEX(このシートにデータを入力します!$B$49:$AA$66,W$1,$A27)&IF(INDEX(このシートにデータを入力します!$B$49:$AA$66,W$1,$A27+1)=\"\",\"\",\" (\"&INDEX(このシートにデータを入力します!$B$49:$AA$66,W$1,$A27+1)&\"年)\")","v":""},null,null,{"$f":"このシートにデータを入力します!Z46","v":0}]
[1,"Trp",null,{"$f":"INDEX(このシートにデータを入力します!$B$72:$X$83,D$1,$A28)&IF(INDEX(このシートにデータを入力します!$B$72:$X$83,D$1,$A28+1)=\"\",\"\",\" (\"&INDEX(このシートにデータを入力します!$B$72:$X$83,D$1,$A28+1)&\"年)\")","v":""},null,null,null,{"$f":"INDEX(このシートにデータを入力します!$B$72:$X$83,H$1,$A28)&IF(INDEX(このシートにデータを入力します!$B$72:$X$83,H$1,$A28+1)=\"\",\"\",\" (\"&INDEX(このシートにデータを入力します!$B$72:$X$83,H$1,$A28+1)&\"年)\")","v":""},null,null,{"$f":"INDEX(このシートにデータを入力します!$B$72:$X$83,K$1,$A28)&IF(INDEX(このシートにデータを入力します!$B$72:$X$83,K$1,$A28+1)=\"\",\"\",\" (\"&INDEX(このシートにデータを入力します!$B$72:$X$83,K$1,$A28+1)&\"年)\")","v":""},null,null,null,{"$f":"INDEX(このシートにデータを入力します!$B$72:$X$83,O$1,$A28)&IF(INDEX(このシートにデータを入力します!$B$72:$X$83,O$1,$A28+1)=\"\",\"\",\" (\"&INDEX(このシートにデータを入力します!$B$72:$X$83,O$1,$A28+1)&\"年)\")","v":""},null,null,null,{"$f":"INDEX(このシートにデータを入力します!$B$72:$X$83,S$1,$A28)&IF(INDEX(このシートにデータを入力します!$B$72:$X$83,S$1,$A28+1)=\"\",\"\",\" (\"&INDEX(このシートにデータを入力します!$B$72:$X$83,S$1,$A28+1)&\"年)\")","v":""},null,null,null,{"$f":"INDEX(このシートにデータを入力します!$B$72:$X$83,W$1,$A28)&IF(INDEX(このシートにデータを入力します!$B$72:$X$83,W$1,$A28+1)=\"\",\"\",\" (\"&INDEX(このシートにデータを入力します!$B$72:$X$83,W$1,$A28+1)&\"年)\")","v":""},null,null,{"$f":"このシートにデータを入力します!B69","v":0}]
[1,null,null,{"$f":"INDEX(このシートにデータを入力します!$B$72:$X$83,D$1+6,$A29)&IF(INDEX(このシートにデータを入力します!$B$72:$X$83,D$1+6,$A29+1)=\"\",\"\",\" (\"&INDEX(このシートにデータを入力します!$B$72:$X$83,D$1+6,$A29+1)&\"年)\")","v":""},null,null,null,{"$f":"INDEX(このシートにデータを入力します!$B$72:$X$83,H$1+6,$A29)&IF(INDEX(このシートにデータを入力します!$B$72:$X$83,H$1+6,$A29+1)=\"\",\"\",\" (\"&INDEX(このシートにデータを入力します!$B$72:$X$83,H$1+6,$A29+1)&\"年)\")","v":""},null,null,{"$f":"INDEX(このシートにデータを入力します!$B$72:$X$83,K$1+6,$A29)&IF(INDEX(このシートにデータを入力します!$B$72:$X$83,K$1+6,$A29+1)=\"\",\"\",\" (\"&INDEX(このシートにデータを入力します!$B$72:$X$83,K$1+6,$A29+1)&\"年)\")","v":""},null,null,null,{"$f":"INDEX(このシートにデータを入力します!$B$72:$X$83,O$1+6,$A29)&IF(INDEX(このシートにデータを入力します!$B$72:$X$83,O$1+6,$A29+1)=\"\",\"\",\" (\"&INDEX(このシートにデータを入力します!$B$72:$X$83,O$1+6,$A29+1)&\"年)\")","v":""},null,null,null,{"$f":"INDEX(このシートにデータを入力します!$B$72:$X$83,S$1+6,$A29)&IF(INDEX(このシートにデータを入力します!$B$72:$X$83,S$1+6,$A29+1)=\"\",\"\",\" (\"&INDEX(このシートにデータを入力します!$B$72:$X$83,S$1+6,$A29+1)&\"年)\")","v":""},null,null,null,{"$f":"INDEX(このシートにデータを入力します!$B$72:$X$83,W$1+6,$A29)&IF(INDEX(このシートにデータを入力します!$B$72:$X$83,W$1+6,$A29+1)=\"\",\"\",\" (\"&INDEX(このシートにデータを入力します!$B$72:$X$83,W$1+6,$A29+1)&\"年)\")","v":""}]
[4,"Hrn",null,{"$f":"INDEX(このシートにデータを入力します!$B$72:$X$83,D$1,$A30)&IF(INDEX(このシートにデータを入力します!$B$72:$X$83,D$1,$A30+1)=\"\",\"\",\" (\"&INDEX(このシートにデータを入力します!$B$72:$X$83,D$1,$A30+1)&\"年)\")","v":""},null,null,null,{"$f":"INDEX(このシートにデータを入力します!$B$72:$X$83,H$1,$A30)&IF(INDEX(このシートにデータを入力します!$B$72:$X$83,H$1,$A30+1)=\"\",\"\",\" (\"&INDEX(このシートにデータを入力します!$B$72:$X$83,H$1,$A30+1)&\"年)\")","v":""},null,null,{"$f":"INDEX(このシートにデータを入力します!$B$72:$X$83,K$1,$A30)&IF(INDEX(このシートにデータを入力します!$B$72:$X$83,K$1,$A30+1)=\"\",\"\",\" (\"&INDEX(このシートにデータを入力します!$B$72:$X$83,K$1,$A30+1)&\"年)\")","v":""},null,null,null,{"$f":"INDEX(このシートにデータを入力します!$B$72:$X$83,O$1,$A30)&IF(INDEX(このシートにデータを入力します!$B$72:$X$83,O$1,$A30+1)=\"\",\"\",\" (\"&INDEX(このシートにデータを入力します!$B$72:$X$83,O$1,$A30+1)&\"年)\")","v":""},null,null,null,{"$f":"INDEX(このシートにデータを入力します!$B$72:$X$83,S$1,$A30)&IF(INDEX(このシートにデータを入力します!$B$72:$X$83,S$1,$A30+1)=\"\",\"\",\" (\"&INDEX(このシートにデータを入力します!$B$72:$X$83,S$1,$A30+1)&\"年)\")","v":""},null,null,null,{"$f":"INDEX(このシートにデータを入力します!$B$72:$X$83,W$1,$A30)&IF(INDEX(このシートにデータを入力します!$B$72:$X$83,W$1,$A30+1)=\"\",\"\",\" (\"&INDEX(このシートにデータを入力します!$B$72:$X$83,W$1,$A30+1)&\"年)\")","v":""},null,null,{"$f":"このシートにデータを入力します!E69","v":0}]
{"$rows_left_out":13}
{"sheet":"このシートにデータを入力します","index":1,"n_rows":71,"n_cols":34,"rows_kept":71,"cut":false,"hidden":false,"merged":[[68,22,68,23],[40,5,40,6],[68,1,68,2],[68,4,68,5],[68,7,68,8],[68,10,68,11],[68,13,68,14],[15,5,15,9],[17,6,17,7],[17,8,17,26],[35,5,35,7],[8,5,8,26],[9,5,9,26],[25,5,25,26],[26,5,26,26],[27,5,27,26],[19,6,19,7],[19,8,19,26],[28,5,28,26],[29,5,29,26],[69,22,69,23],[6,5,6,7],[11,5,11,7],[31,5,31,7],[33,5,33,7],[45,10,45,11],[45,13,45,14],[45,16,45,17],[21,5,21,7],[23,5,23,7],[45,4,45,5],[45,7,45,8],[27,2,27,4],[29,2,29,4],[31,1,31,4],[13,5,13,9],[69,16,69,17],[69,19,69,20],[46,1,46,2],[68,16,68,17],[46,19,46,20],[68,19,68,20],[69,1,69,2],[69,4,69,5],[46,13,46,14],[46,16,46,17],[46,10,46,11],[33,1,33,4],[35,1,35,4],[69,10,69,11],[69,13,69,14],[37,1,37,4],[45,1,45,2],[69,7,69,8],[37,5,37,9],[46,4,46,5],[46,7,46,8],[15,1,15,4],[21,1,21,4],[23,1,23,4],[25,2,25,4],[26,2,26,4],[25,1,29,1],[17,1,17,4],[28,2,28,4],[19,1,19,4],[6,1,6,4],[8,1,8,4],[9,1,9,4],[11,1,11,4],[13,1,13,4],[45,25,45,26],[46,22,46,23],[46,25,46,26],[45,19,45,20],[45,22,45,23]]}
[null,null,null,null,null,null,null,null,null,null,null,null,null,null,null,null,null,null,null,null,null,null,null,null,null,null,null,null,null,null,"中Ａ","有","完了",1]
[null,null,"の部分にデータを入力してください。　列や行の挿入，削除は出来ません。",null,null,null,null,null,null,null,null,null,null,null,null,null,null,null,null,null,null,null,null,null,null,null,null,null,null,null,"中Ｓ","無","まだ",2]
[null,null,"データを消去する場合は　「Delete」キーを使用してください。",null,null,null,null,null,null,null,null,null,null,null,null,null,null,null,null,null,null,null,null,null,null,null,null,null,null,null,"高A",null,"出版譜のため不要",3]
[null,null,null,null,null,null,null,null,null,null,null,null,null,null,null,null,null,null,null,null,null,null,null,null,null,null,null,null,null,null,"高Ｓ",null,null,4]
[null,null,null,null,null,null,null,null,null,null,null,null,null,null,null,null,null,null,null,null,null,null,null,null,null,null,null,null,null,null,"大",null,null,5]
[null,null,null,null,null,null,null,null,null,null,null,null,null,null,null,null,null,null,null,null,null,null,null,null,null,null,null,null,null,null,"職・一"]
[null,"団体コード№",null,null,null,null,null,null,null,null,null,null,null,null,null,null,null,null,null,null,null,null,null,null,null,null,null,null,null,null,"祭"]
[]
[null,"ふりがな"]
[null,"団体名"]
[]
[null,"団体の総員数（5/9現在）"]
[]
[null,"団体長（学校長）名"]
[]
[null,"指揮者名"]
[]
[null,"所在地",null,null,null,"〒"]
[]
[null,"書類送付先",null,null,null,"〒"]
[]
[null,"参加部門"]
[]
[null,"ピアノの使用の有無"]
[]
[null,"自由曲","原語"]
[null,null,"日本語"]
[null,null,"作曲者名"]
[null,null,"編曲者名"]
[null,null,"著作権のある\n作品の許諾先"]
{"$rows_left_out":41}